EldoS | Feel safer!

Software components for data protection, secure storage and transfer

Testing in Mac OS

Also by EldoS: CallbackRegistry
A component to monitor and control Windows registry access and create virtual registry keys.
#30755
Posted: 09/17/2014 01:54:27
by Alexander Plas (EldoS Corp.)

It looks like you link all libraries for target GoSafe_DriveTest but building GoSafe_Drive. If it is not right, try please to link the libraries by set "Other Linker Flags" to "-liconv -lfuse_ino64" or change direct linking .dylyb files to .la files
#30758
Posted: 09/17/2014 04:17:49
by manish mahor (Standard support level)
Joined: 02/26/2014
Posts: 33

hello
i have attached the -lfuse_ino62.dylib file but it is giving error that file not found please see the attachment for error shown and file in finder window.

www.isohelpline.com/downloads/Archive3.zip
#30759
Posted: 09/17/2014 07:21:29
by Alexander Plas (EldoS Corp.)

Add please in your project "Build Settings" in value "Library Search Paths" path

/usr/local/lib/**
#30775
Posted: 09/19/2014 00:37:52
by manish mahor (Standard support level)
Joined: 02/26/2014
Posts: 33

hello
i am getting error in Xcode compilation after updating files given by you.
(Ticket # 26042 ("Testing in Ubuntu")

Quote Here is an update for 64-bit platform. It includes few changes which I just have made for Mac. I've also tested it on Linux. In the next post I'll attach update for 32-bit Linux with same changes.

)


let me know if i am using the wrong files in Xcode (mac).

http://isohelpline.com/downloads/error.png
#30811
Posted: 09/25/2014 06:13:57
by manish mahor (Standard support level)
Joined: 02/26/2014
Posts: 33

waiting for your reply
#30812
Posted: 09/25/2014 06:19:15
by Alexander Plas (EldoS Corp.)

Hello

It looks like you try to use C++ class in plain C code.
#30820
Posted: 09/26/2014 04:11:14
by manish mahor (Standard support level)
Joined: 02/26/2014
Posts: 33

Hello,

When using original libraries supplied in download it asks for StoreUtills.h.

New libraries were provided in another help desk ticket which do not require above .h file but in Qt Mac OS I am getting for lowing compilation error:

In issues window , I see problem description as:
Quote
:-1: error: symbol(s) not found for architecture x86_64


In Compile Output window I can see details as:

Quote
Undefined symbols for architecture x86_64:
"___sincos_stret", referenced from:
___sincos in libsolfsfuse.a(StoreUtils.o)
"___sincosf_stret", referenced from:
___sincosf in libsolfsfuse.a(StoreUtils.o)
"___sincospi_stret", referenced from:
___sincospi in libsolfsfuse.a(StoreUtils.o)
"___sincospif_stret", referenced from:
___sincospif in libsolfsfuse.a(StoreUtils.o)
ld: symbol(s) not found for architecture x86_64
clang: error: linker command failed with exit code 1 (use -v to see invocation)
make: *** [Test_26.app/Contents/MacOS/Test_26] Error 1
14:31:58: The process "/usr/bin/make" exited with code 2.
Error while building/deploying project Test_26 (kit: Desktop Qt 5.3 clang 64bit)
When executing step "Make"




Seems the new library is still using StoreUtills
Also by EldoS: CallbackProcess
A component to control process creation and termination in Windows and .NET applications.

Reply

Statistics

Topic viewed 7965 times

Number of guests: 1, registered members: 0, in total hidden: 0




|

Back to top

As of July 15, 2016 EldoS Corporation will operate as a division of /n software inc. For more information, please read the announcement.

Got it!